Butane, 2-bromo-2,3-dimethyl-

Kovats' RI, non-polar column, isothermal

View large format table.

Column type Active phase Temperature (C) I Reference Comment
PackedApiezon L100.903.Castello and D'Amato, 1985He, Chromosorb W AW DMCS; Column length: 3. m
PackedApiezon L125.921.Castello and D'Amato, 1985He, Chromosorb W AW DMCS; Column length: 3. m
PackedApiezon L75.896.Castello and D'Amato, 1985He, Chromosorb W AW DMCS; Column length: 3. m

Kovats' RI, polar column, isothermal

View large format table.

Column type Active phase Temperature (C) I Reference Comment
PackedCarbowax 20M100.1035.Castello and D'Amato, 1985He, Chromosorb W AW DMCS; Column length: 3. m
PackedCarbowax 20M125.1053.Castello and D'Amato, 1985He, Chromosorb W AW DMCS; Column length: 3. m
PackedCarbowax 20M75.1028.Castello and D'Amato, 1985He, Chromosorb W AW DMCS; Column length: 3. m

References

Castello and D'Amato, 1985
Castello, G.; D'Amato, G., Gas Chromatography Separation and Identification of Linear and Branched-Chain Alkyl Bromides, J. Chromatogr., 1985, 324, 363-371, https://doi.org/10.1016/S0021-9673(01)81335-2 . [all data]