Guanidine carbonate

Condensed phase thermochemistry data

Data compiled by: Eugene S. Domalski and Elizabeth D. Hearing

Quantity Value Units Method Reference Comment
solid,1 bar295.35J/mol*KN/AHuffman, Ellis, et al., 1940Extrapolation below 90 K, 93.35 J/mol*K

Constant pressure heat capacity of solid

Cp,solid (J/mol*K) Temperature (K) Reference Comment
258.86298.1Huffman, Ellis, et al., 1940T = 86 to 298 K. Value is unsmoothed experimental datum.

References

Huffman, Ellis, et al., 1940
Huffman, H.M.; Ellis, E.L.; Borsook, H., Thermal data. XI. The heat capacities and entropies of guanidine carbonate, glutamic acid hydrochloride, ornithine dihydrochloride, D-lactic acid and L-lactic acid, J. Am. Chem. Soc., 1940, 62, 297-299. [all data]