3-Hexene

Phase change data

Data compiled by: Thermodynamics Research Center, NIST Boulder Laboratories, Chris Muzny director

Quantity Value Units Method Reference Comment
Tboil339.9 ± 0.4KAVGN/AAverage of 6 values; Individual data points
Quantity Value Units Method Reference Comment
Tc502.25KN/ALi, Ma, et al., 1993Uncertainty assigned by TRC = 0.1 K
Quantity Value Units Method Reference Comment
Pc33.39barN/ALi, Ma, et al., 1993Uncertainty assigned by TRC = 0.20 bar
Quantity Value Units Method Reference Comment
ρc2.84mol/lN/ALi, Ma, et al., 1993Uncertainty assigned by TRC = 0.1 mol/l

In addition to the Thermodynamics Research Center (TRC) data available from this site, much more physical and chemical property data is available from the following TRC products:

Normal alkane RI, non-polar column, temperature ramp

View large format table.

Column type Active phase I Reference Comment
CapillaryDB-1614.Ciccioli, Cecinato, et al., 199260. m/0.32 mm/1.2 μm, He, 30. C @ 10. min, 3. K/min; Tend: 240. C
CapillaryOV-101602.Mandelshtam, Kharicheva, et al., 1991Helium, 50. C @ 0. min, 3. K/min, 220. C @ 0. min; Column length: 54. m; Column diameter: 0.26 mm

Normal alkane RI, non-polar column, custom temperature program

View large format table.

Column type Active phase I Reference Comment
CapillaryDB-1611.Ciccioli, Cecinato, et al., 199460. m/0.32 mm/0.25 μm; Program: not specified

References

Li, Ma, et al., 1993
Li, Y.; Ma, P.; Ruan, Y., Measurement of the critical constants of 1-hexene and 1-bromopropane, Shiyou Huagong, 1993, 22, 322-324. [all data]