Urea, butyl-

Gas phase thermochemistry data

Data compiled by: Hussein Y. Afeefy, Joel F. Liebman, and Stephen E. Stein

Quantity Value Units Method Reference Comment
Δfgas-313.6 ± 4.2kJ/molCcbKabo, Miroshnichenko, et al., 1990see Simirsky, Kabo, et al., 1987

References

Kabo, Miroshnichenko, et al., 1990
Kabo, G.Ya.; Miroshnichenko, E.A.; Frenkel, M.L.; Kozyro, A.A.; Simirskii, V.V.; Krasulin, A.P.; Vorob'eva, V.P.; Lebedev, Yu.A., Thermochemistry of urea alkyl derivatives, Bull. Acad. Sci. USSR, Div. Chem. Sci., 1990, 662-667. [all data]

Simirsky, Kabo, et al., 1987
Simirsky, V.V.; Kabo, G.J.; Frenkel, M.L., Additivity of the enthalpies of formation of urea derivatives in the crystalline state, J. Chem. Thermodyn., 1987, 19, 1121-1127. [all data]