2-methyl-5-nitro-1,3-benzenedicarboxylic acid

Phase change data

Data compiled by: Thermodynamics Research Center, NIST Boulder Laboratories, Chris Muzny director

Quantity Value Units Method Reference Comment
Tfus329.KN/ASitzmann, 1976Uncertainty assigned by TRC = 3. K

In addition to the Thermodynamics Research Center (TRC) data available from this site, much more physical and chemical property data is available from the following TRC products:

References

Sitzmann, 1976
Sitzmann, M.E., Synthesis of 2,6-Diamino-4-nitrotoluene, J. Chem. Eng. Data, 1976, 21, 242. [all data]