4-Thiouracil

Gas phase ion energetics data

Data compiled by: John E. Bartmess

Electron affinity determinations

EA (eV) Method Reference Comment
1.05 ± 0.10LPESLi, Chen, et al., 2011Stated electron affinity is the Vertical Detachment Energy

References

Li, Chen, et al., 2011
Li, X.A.; Chen, J.; Bowen, K.H., Photoelectron spectroscopic study of the negative ions of 4-thiouracil and 2,4-dithiouracil, J. Chem. Phys., 2011, 134, 7, 074304, https://doi.org/10.1063/1.3555177 . [all data]