Benzoyl chloride, 4-bromo-

Phase change data

Data compiled as indicated in comments:
BS - Robert L. Brown and Stephen E. Stein
TRC - Thermodynamics Research Center, NIST Boulder Laboratories, Chris Muzny director

Quantity Value Units Method Reference Comment
Tboil519.2KN/AWeast and Grasselli, 1989BS
Quantity Value Units Method Reference Comment
Tfus310.7KN/ABranch and Nixon, 1936Uncertainty assigned by TRC = 1. K; TRC
Tfus315.KN/AAdams and Ulich, 1920Uncertainty assigned by TRC = 4. K; TRC

Reduced pressure boiling point

Tboil (K) Pressure (bar) Reference Comment
447.20.136Aldrich Chemical Company Inc., 1990BS

In addition to the Thermodynamics Research Center (TRC) data available from this site, much more physical and chemical property data is available from the following TRC products:

References

Weast and Grasselli, 1989
CRC Handbook of Data on Organic Compounds, 2nd Editon, Weast,R.C and Grasselli, J.G., ed(s)., CRC Press, Inc., Boca Raton, FL, 1989, 1. [all data]

Branch and Nixon, 1936
Branch, G.E.K.; Nixon, A.C., The Rate of Alcoholysis of Acyl Chlorides, J. Am. Chem. Soc., 1936, 58, 2499-2504. [all data]

Adams and Ulich, 1920
Adams, R.; Ulich, L.H., The Use of Oxalyl Chloride and Bromide for Producing Acid Chlorides, Acid Bromides or Acid Anhydrides III, J. Am. Chem. Soc., 1920, 42, 599-611. [all data]

Aldrich Chemical Company Inc., 1990
Aldrich Chemical Company Inc., Catalog Handbook of Fine Chemicals, Aldrich Chemical Company, Inc., Milwaukee WI, 1990, 1. [all data]