Cyclohexene, 3-methyl-6-(1-methylethylidene)-

Van Den Dool and Kratz RI, non-polar column, temperature ramp

Data compiled by: NIST Mass Spectrometry Data Center, William E. Wallace, director

Column type CapillaryCapillaryCapillaryCapillaryCapillary
Active phase DB-5DB-5DB-5HP-5Mega 5MS
Column length (m) 30.30.30.30.30.
Carrier gas HeHeHeHeHe
Substrate
Column diameter (mm) 0.250.250.250.250.25
Phase thickness (μm) 0.250.250.250.250.25
Tstart (C) 60.60.50.60.40.
Tend (C) 240.240.250.380.240.
Heat rate (K/min) 3.3.5.3.3.
Initial hold (min) 2.2.2. 2.
Final hold (min)
I 1081.1081.1088.1068.1077.
ReferenceBatista-Pereira, Fernandes, et al., 2006Batista-Pereira, Fernandes, et al., 2006Su, Ho, et al., 2006Couladis, Tsortanidou, et al., 2001Verzera, Trozzi, et al., 2000
Comment MSDC-RI MSDC-RI MSDC-RI MSDC-RI MSDC-RI

Kovats' RI, non-polar column, temperature ramp

Data compiled by: NIST Mass Spectrometry Data Center, William E. Wallace, director

Column type CapillaryCapillaryCapillaryCapillaryCapillary
Active phase DB-5DB-5MSDB-5HP-5DB-5
Column length (m) 30.30.30.30.30.
Carrier gas HeHeHeHeHe
Substrate
Column diameter (mm) 0.250.250.260.250.25
Phase thickness (μm) 0.250.250.250.250.25
Tstart (C) 60.60.60.60.50.
Tend (C)  280.246.260.250.
Heat rate (K/min) 3.3.3.3.0.5
Initial hold (min)     5.
Final hold (min)  30.  10.
I 1090.1057.1088.1088.1084.
ReferenceLucero, Fredrickson, et al., 2006Marongiu, Porcedda, et al., 2006Adams, Morris, et al., 2005Lopes, Strobl, et al., 2004Viña and Murillo, 2003
Comment MSDC-RI MSDC-RI MSDC-RI MSDC-RI MSDC-RI
Column type CapillaryCapillaryCapillaryCapillary
Active phase DB-5DB-5SE-54DB-5
Column length (m) 25.30.30.30.
Carrier gas HeH2 He
Substrate
Column diameter (mm) 0.220.200.260.26
Phase thickness (μm) 0.25 0.250.25
Tstart (C) 60.60.60.60.
Tend (C) 240.240.246.246.
Heat rate (K/min) 3.3.3.3.
Initial hold (min)
Final hold (min)
I 1082.1090.1086.1086.
ReferenceEl-Ghorab, Fadel, et al., 2002Moreira, Sousa, et al., 2001Adams, 2000Adams, 2000, 2
Comment MSDC-RI MSDC-RI MSDC-RI MSDC-RI

References

Batista-Pereira, Fernandes, et al., 2006
Batista-Pereira, L.G.; Fernandes, J.B.; Correa, A.G.; da Silva, M.F.G.F.; Vieira, P.C., Electrophysiological responses of eucalyptus brown looper Thyrinteina arnobia to essential oils of seven Eucalyptus species, J. Braz. Chem. Soc., 2006, 17, 3, 555-561, https://doi.org/10.1590/S0103-50532006000300019 . [all data]

Su, Ho, et al., 2006
Su, Y.C.; Ho, C.L.; Wang, E.I.C., Analysis of leaf essential oils from the indigenous five conifers of Taiwan, Flavour Fragr. J., 2006, 21, 3, 447-452, https://doi.org/10.1002/ffj.1685 . [all data]

Couladis, Tsortanidou, et al., 2001
Couladis, M.; Tsortanidou, V.; Francisco-Ortega, J.; Santos-Guerra, A.; Harvala, C., Composition of the essential oils of Argyranthemum species growing in the Canary Islands, Flavour Fragr. J., 2001, 16, 2, 103-106, https://doi.org/10.1002/ffj.954 . [all data]

Verzera, Trozzi, et al., 2000
Verzera, A.; Trozzi, A.; Cotroneo, A.; Lorenzo, D.; Dellacassa, E., Uruguayan essential oil. 12. Composition of Nova and Satsuma mandarin oils, J. Agric. Food Chem., 2000, 48, 7, 2903-2909, https://doi.org/10.1021/jf990734z . [all data]