1H-1,2,4-Triazol-5-amine, 1-ethyl-

Gas phase ion energetics data

Data compiled by: Sharon G. Lias, Rhoda D. Levin, and Sherif A. Kafafi

Appearance energy determinations

Ion AE (eV) Other Products MethodReferenceComment
C2H4N4+10.0C2H4EIMaquestiau, Van Haverbeke, et al., 1975
C4H8N4+8.5?EIMaquestiau, Van Haverbeke, et al., 1975

References

Maquestiau, Van Haverbeke, et al., 1975
Maquestiau, A.; Van Haverbeke, Y.; Flammang, R.; Cooks, R.G., Fragmentation d'azoles sous l'impact electronique, Org. Mass Spectrom., 1975, 10, 946. [all data]