(Z)-1-propene-1,2,3-tricarboxylic acid

Condensed phase thermochemistry data

Data compiled by: Hussein Y. Afeefy, Joel F. Liebman, and Stephen E. Stein

Quantity Value Units Method Reference Comment
Δfsolid-290.872kcal/molCcbKobenina and Pobedinskaya, 1983Author's hf_298=-1221.59 kJ/mol
Δfsolid-292.7 ± 1.8kcal/molCcbWilhoit and Lei, 1965
Quantity Value Units Method Reference Comment
Δcsolid-478.384kcal/molCcbKobenina and Pobedinskaya, 1983Author's hf_298=-1221.59 kJ/mol; Corresponding Δfsolid = -290.868 kcal/mol (simple calculation by NIST; no Washburn corrections)
Δcsolid-476.6 ± 1.8kcal/molCcbWilhoit and Lei, 1965Reanalyzed by Cox and Pilcher, 1970, Original value = -477.46 kcal/mol; Corresponding Δfsolid = -292.65 kcal/mol (simple calculation by NIST; no Washburn corrections)

References

Kobenina and Pobedinskaya, 1983
Kobenina, N.M.; Pobedinskaya, A.I., Standard heats of combustion and formation of cis-aconitic, α-oxoglutaric, and oxalacetic acids, Izv. Vyssh. Uchebn. Zaved., Khim. Khim. Tekhnol., 1983, 26, 1015-1016. [all data]

Wilhoit and Lei, 1965
Wilhoit, R.C.; Lei, I., Thermochemistry of biologically important compounds. Heats of combustion of five organic acids., J. Chem. Eng. Data, 1965, 10, 166-168. [all data]

Cox and Pilcher, 1970
Cox, J.D.; Pilcher, G., Thermochemistry of Organic and Organometallic Compounds, Academic Press, New York, 1970, 1-636. [all data]