Platambin-1,6-dione

Normal alkane RI, non-polar column, temperature ramp

Data compiled by: NIST Mass Spectrometry Data Center, William E. Wallace, director

Column type Capillary
Active phase OV-1
Column length (m) 30.
Carrier gas Helium
Substrate
Column diameter (mm) 0.25
Phase thickness (μm) 0.25
Tstart (C) 40.
Tend (C) 300.
Heat rate (K/min) 4.
Initial hold (min) 2.
Final hold (min) 10.
I 1923.
ReferenceNibret and Wink, 2009
Comment MSDC-RI

References

Nibret and Wink, 2009
Nibret, E.; Wink, M., Volatile components of four Ethiopian Artemisia species extracts and their in vitro antipatrypanosomal and cytotoxic activities, Phytomedicine, 2009, 00, 0, 000-000. [all data]