1H-Benzimidazole, 2-(1-methylethyl)-

Phase change data

Data compiled by: William E. Acree, Jr., James S. Chickos

Quantity Value Units Method Reference Comment
Δsub109.9 ± 2.7kJ/molCda Silva, da Silva, et al., 2004

References

da Silva, da Silva, et al., 2004
da Silva, Manuel A.V. Ribeiro; da Silva, Maria D.M.C. Ribeiro; Amaral, Luisa M.P.F.; Jiménez, Pilar; Roux, Maria Victoria; Dávalos, Juan Z.; Temprado, Manuel; Cabildo, Pilar; Claramunt, Rosa M.; Elguero, José; Mó, Otilia; Yáñez, Manuel, Experimental thermochemical study of two 2-alkylbenzimidazole isomers (alkyl=propyl and isopropyl), The Journal of Chemical Thermodynamics, 2004, 36, 6, 533-539, https://doi.org/10.1016/j.jct.2004.03.005 . [all data]