Vinyl phosphine

Reaction thermochemistry data

Data compiled by: John E. Bartmess

Individual Reactions

C2H4P- + Hydrogen cation = Vinyl phosphine

By formula: C2H4P- + H+ = C2H5P

Quantity Value Units Method Reference Comment
Δr1508. ± 11.kJ/molG+TSMo, Yanez, et al., 1999gas phase
Quantity Value Units Method Reference Comment
Δr1477. ± 9.6kJ/molIMREMo, Yanez, et al., 1999gas phase

References

Mo, Yanez, et al., 1999
Mo, O.; Yanez, M.; Decouzon, M.; Gal, J.F.; Maria, P.C.; Guillemin, J.L., Gas-phase basicity and acidity trends in alpha,beta-unsaturated amines, phosphines, and arsines, J. Am. Chem. Soc., 1999, 121, 19, 4653-4663, https://doi.org/10.1021/ja982657e . [all data]