o-Benzoquinone

Reaction thermochemistry data

Data compiled by: John E. Bartmess

Individual Reactions

(CAS Reg. No. 20217-29-2 • 4294967295o-Benzoquinone) + o-Benzoquinone = CAS Reg. No. 20217-29-2

By formula: (CAS Reg. No. 20217-29-2 • 4294967295C6H4O2) + C6H4O2 = CAS Reg. No. 20217-29-2

Quantity Value Units Method Reference Comment
Δr438. ± 23.kJ/molN/AFujio, McIver, et al., 1981gas phase; value altered from reference due to change in acidity scale

References

Fujio, McIver, et al., 1981
Fujio, M.; McIver, R.T., Jr.; Taft, R.W., Effects on the acidities of phenols from specific substituent-solvent interactions. Inherent substituent parameters from gas phase acidities, J. Am. Chem. Soc., 1981, 103, 4017. [all data]