(1S,5S)-4-Methylene-1-((R)-6-methylhept-5-en-2-yl)bicyclo[3.1.0]hexane

Kovats' RI, non-polar column, temperature ramp

View large format table.

Column type Active phase I Reference Comment
CapillaryDB-51459.Lucero, Fredrickson, et al., 200630. m/0.25 mm/0.25 μm, He, 3. K/min; Tstart: 60. C
CapillaryBP-51444.Weissbecker B., Van Loon J.J.A., et al., 200025. m/0.25 mm/0.25 μm, He, 3. K/min; Tstart: 60. C; Tend: 200. C

Van Den Dool and Kratz RI, non-polar column, temperature ramp

View large format table.

Column type Active phase I Reference Comment
CapillaryDB-51465.Sabulal, Dan, et al., 200730. m/0.25 mm/0.25 μm, He, 5. K/min; Tstart: 60. C; Tend: 260. C

Normal alkane RI, non-polar column, temperature ramp

View large format table.

Column type Active phase I Reference Comment
CapillaryHP-5 MS1464.Sardashti, Valizadeh, et al., 201360. m/0.25 mm/0.25 μm, Helium, 40. C @ 1. min, 3. K/min, 250. C @ 20. min
CapillaryDB-5 MS1467.Noudogbessi, Yedomonhan, et al., 200830. m/0.25 mm/0.25 μm, Helium, 50. C @ 5. min, 5. K/min, 300. C @ 5. min
CapillaryCP Sil 5 CB1437.Olawore, Ogunwande, et al., 200525. m/0.25 mm/0.15 μm, 3. K/min; Tstart: 50. C; Tend: 230. C

Normal alkane RI, non-polar column, custom temperature program

View large format table.

Column type Active phase I Reference Comment
CapillaryCP Sil 5 CB1446.Weyerstahl, Marschall, et al., 1997N2; Column length: 25. m; Program: not specified

Normal alkane RI, polar column, temperature ramp

View large format table.

Column type Active phase I Reference Comment
CapillaryDB-Wax1648.Ngassoum, Yonkeu, et al., 199960. m/0.25 mm/0.25 μm, He, 4. K/min; Tstart: 60. C; Tend: 240. C

References

Lucero, Fredrickson, et al., 2006
Lucero, M.E.; Fredrickson, E.L.; Estell, R.E.; Morrison, A.A.; Richman, D.B., Volatile Composition of Gutierrezia sarothrae (Broom Snakeweed) as Determined by Steam Distillation and Solid Phase Microextraction, J. Essent. Oil Res., 2006, 18, 2, 121-125, https://doi.org/10.1080/10412905.2006.9699039 . [all data]

Weissbecker B., Van Loon J.J.A., et al., 2000
Weissbecker B.; Van Loon J.J.A.; Posthumus M.A.; Bouwmeester H.J.; Dicke M., Identification of volatile potato sesquiterpenoids and their olfactory detection by the two-spotted stinkbug Perillus bioculatus, J. Chem. Ecol., 2000, 26, 6, 1433-1445, https://doi.org/10.1023/A:1005535708866 . [all data]

Sabulal, Dan, et al., 2007
Sabulal, B.; Dan, M.; John, A.; Kurup, R.; Chandrika, S.P.; George, V., Phenylbutanoid-rich rhizome oil of Zingiber neesanum from Western Ghats, southern India, Flavour Fragr. J., 2007, 22, 6, 521-524, https://doi.org/10.1002/ffj.1834 . [all data]

Sardashti, Valizadeh, et al., 2013
Sardashti, A.R.; Valizadeh, J.; Adhami, Y., Variations in the essential oil composition of Peroskia abrotonolides of different growth stage in Baluchestan, Middle-East J. Sci. Res., 2013, 13, 6, 781-784. [all data]

Noudogbessi, Yedomonhan, et al., 2008
Noudogbessi, J.-P.; Yedomonhan, P.; Sohounhloue, D.C.K.; Chalchat, J.-C.; Figueredo, G., Chemical composition of essential oil of syzygium guineense (Willd.) DC. var. guineense (Myrtaceae) from Benin, Rec. Nat. Prod., 2008, 33-38. [all data]

Olawore, Ogunwande, et al., 2005
Olawore, N.O.; Ogunwande, I.A.; Ekundayo, O.; Adeleke, K.A., Chemical composition of the leaf and fruit essential oils of Murraya paniculata (L.) Jack. (Syn. Murraya exotica Linn.), Flavour Fragr. J., 2005, 20, 1, 54-56, https://doi.org/10.1002/ffj.1365 . [all data]

Weyerstahl, Marschall, et al., 1997
Weyerstahl, P.; Marschall, H.; Seelmann, I.; Kaul, V.K., Constituents of the flower essential oil of Ageratina adenophora (Spreng.) K. et R. from India, Flavour Fragr. J., 1997, 12, 6, 387-396, https://doi.org/10.1002/(SICI)1099-1026(199711/12)12:6<387::AID-FFJ677>3.0.CO;2-F . [all data]

Ngassoum, Yonkeu, et al., 1999
Ngassoum, M.B.; Yonkeu, S.; Jirovetz, L.; Buchbauer, G.; Schmaus, G.; Hammerschmidt, F.-J.H., Chemical composition of essential oils of Lantana camara leaves and flowers from Cameroon and Madagascar, Flavour Fragr. J., 1999, 14, 4, 245-250, https://doi.org/10.1002/(SICI)1099-1026(199907/08)14:4<245::AID-FFJ819>3.0.CO;2-X . [all data]