1,3,5-Triselena-2,4,6-tristannacyclohexane, 2,2,4,4,6,6-hexamethyl-

Gas phase ion energetics data

Data compiled by: Sharon G. Lias and Joel F. Liebman

Ionization energy determinations

IE (eV) Method Reference Comment
7.7PECauletti, Grandinetti, et al., 1988
8.31PECauletti, Grandinetti, et al., 1988Vertical value

References

Cauletti, Grandinetti, et al., 1988
Cauletti, C.; Grandinetti, F.; Granozzi, G.; Sebald, A.; Wrackmeyer, B., Sn-S and Sn-Se bonding in some tin(IV) compounds studied by UV photoelectron and NMR spectroscopy and pseudopotential ab initio calculations, Organometallics, 1988, 7, 262. [all data]