2,2'-azonaphthalene

Phase change data

Data compiled by: Thermodynamics Research Center, NIST Boulder Laboratories, Chris Muzny director

Quantity Value Units Method Reference Comment
Tfus478.15KN/AShine, 1956Uncertainty assigned by TRC = 2. K

In addition to the Thermodynamics Research Center (TRC) data available from this site, much more physical and chemical property data is available from the following TRC products:

References

Shine, 1956
Shine, H.J., The "Thernal" Rearrangement of Hydrazo Compounds I. 2,2'-Hydrazo- naphthalene, J. Am. Chem. Soc., 1956, 78, 4807. [all data]