2',5'-Dimethoxypropiophenone

Van Den Dool and Kratz RI, non-polar column, temperature ramp

View large format table.

Column type Active phase I Reference Comment
CapillaryDB-51658.Zhang, Xu, et al., 200530. m/0.25 mm/0.25 μm, N2, 45. C @ 10. min, 2.5 K/min, 180. C @ 20. min

Van Den Dool and Kratz RI, polar column, temperature ramp

View large format table.

Column type Active phase I Reference Comment
CapillaryPEG-20M2270.Zhang, Xu, et al., 200530. m/0.25 mm/0.25 μm, N2, 50. C @ 8. min, 4. K/min, 220. C @ 20. min

References

Zhang, Xu, et al., 2005
Zhang, F.; Xu, Q.; Fu, S.; Ma, X.; Xiao, H.; Liang, X., Chemical constituents of the essential oil of Asarum forbesii Maxim (Aristolochiaceae), Flavour Fragr. J., 2005, 20, 3, 318-320, https://doi.org/10.1002/ffj.1423 . [all data]