Benzene, 1-bromo-2-(chloromethyl)-

Normal alkane RI, non-polar column, custom temperature program

View large format table.

Column type Active phase I Reference Comment
CapillaryPolydimethyl siloxanes1244.Zenkevich, 2003Program: not specified
CapillaryMethyl Silicone1244.Zenkevich, 2001Program: not specified

References

Zenkevich, 2003
Zenkevich, I.G., Criteria for Evaluation of Elution Order of Isomeric Organic Compounds, Zh. Phys. Khim. (Rus.), 2003, 77, 1, 92-98. [all data]

Zenkevich, 2001
Zenkevich, I.G., Interpretation of Gas Chromatographic Retention Indices in estimation of Structures of Isomeric Products of Radical Chlorinating of Alkyl Arenes, Zh. Org. Khim., 2001, 37, 2, 283-293. [all data]