Benzene, 2-bromo-1,3,5-trimethyl-

Kovats' RI, non-polar column, isothermal

View large format table.

Column type Active phase Temperature (C) I Reference Comment
PackedSqualane130.1254.Cook and Raushel, 1972He, Chromosorb W AW DMCS (80-100 mesh)

Van Den Dool and Kratz RI, non-polar column, temperature ramp

View large format table.

Column type Active phase I Reference Comment
CapillaryOV-11239.5Gautzsch and Zinn, 19968. K/min; Tstart: 35. C; Tend: 300. C

Phase change data

Data compiled by: Robert L. Brown and Stephen E. Stein

Quantity Value Units Method Reference Comment
Tboil498.2KN/AWeast and Grasselli, 1989
Tboil498.KN/AAmerican Tokyo Kasei, 1988

Reduced pressure boiling point

Tboil (K) Pressure (atm) Reference
379.20.021Weast and Grasselli, 1989
381. - 383.0.026Frinton Laboratories Inc., 1986

References

Cook and Raushel, 1972
Cook, L.E.; Raushel, F.M., Calculation of retention indices for benzene and benzene derivatives on the basis of molecular structure, J. Chromatogr., 1972, 65, 3, 556-559, https://doi.org/10.1016/S0021-9673(00)85001-3 . [all data]

Gautzsch and Zinn, 1996
Gautzsch, R.; Zinn, P., Use of incremental models to estimate the retention indexes of aromatic compounds, Chromatographia, 1996, 43, 3/4, 163-176, https://doi.org/10.1007/BF02292946 . [all data]