Difluoroboroxin

Gas phase thermochemistry data

Quantity Value Units Method Reference Comment
Δfgas-475.000kcal/molReviewChase, 1998Data last reviewed in December, 1965
Quantity Value Units Method Reference Comment
gas,1 bar78.630cal/mol*KReviewChase, 1998Data last reviewed in December, 1965

Gas Phase Heat Capacity (Shomate Equation)

Cp° = A + B*t + C*t2 + D*t3 + E/t2
H° − H°298.15= A*t + B*t2/2 + C*t3/3 + D*t4/4 − E/t + F − H
S° = A*ln(t) + B*t + C*t2/2 + D*t3/3 − E/(2*t2) + G
    Cp = heat capacity (cal/mol*K)
    H° = standard enthalpy (kcal/mol)
    S° = standard entropy (cal/mol*K)
    t = temperature (K) / 1000.

View plot Requires a JavaScript / HTML 5 canvas capable browser.

View table.

Temperature (K) 298. - 1100.1100. - 6000.
A 5.10691048.13740
B 87.106600.854408
C -68.33731-0.171841
D 19.791500.011847
E -0.070155-5.327532
F -480.0660-503.0000
G 61.30729117.4460
H -475.0000-475.0000
ReferenceChase, 1998Chase, 1998
Comment Data last reviewed in December, 1965 Data last reviewed in December, 1965

References

Chase, 1998
Chase, M.W., Jr., NIST-JANAF Themochemical Tables, Fourth Edition, J. Phys. Chem. Ref. Data, Monograph 9, 1998, 1-1951. [all data]