Silanamine, N-sulfinyl-

Gas phase ion energetics data

Data compiled by: Sharon G. Lias, Rhoda D. Levin, and Sherif A. Kafafi

Ionization energy determinations

IE (eV) Method Reference Comment
10.55PECradock, Ebsworth, et al., 1975Vertical value

References

Cradock, Ebsworth, et al., 1975
Cradock, S.; Ebsworth, E.A.V.; Meikle, G.D.; Rankin, D.W.H., Preparation, properties, and molecular structure of silylsulphinylamine, J. Chem. Soc. Dalton Trans., 1975, 805. [all data]