Strychnine

Kovats' RI, non-polar column, isothermal

View large format table.

Column type Active phase Temperature (C) I Reference Comment
CapillaryBP-1275.3125.Japp, Gill, et al., 198725. m/0.22 mm/0.25 μm, N2
CapillaryDB-1275.3140.Japp, Gill, et al., 198730. m/0.53 mm/1.5 μm, N2
PackedSE-30280.3100.Musumarra, Scarlata, et al., 1987N2, 1% se-30 on Anachrom ABS(80-100mesh); Column length: 2. m
PackedOV-1280.3120.Berninger and Möller, 1977

Kovats' RI, non-polar column, temperature ramp

View large format table.

Column type Active phase I Reference Comment
CapillarySE-303115.Schepers, Wijsbeek, et al., 198225. m/0.49 mm/1.14 μm, 100. C @ 2. min, 8. K/min, 275. C @ 15. min

Kovats' RI, non-polar column, custom temperature program

View large format table.

Column type Active phase I Reference Comment
PackedOV-1013150.McLinden and Stenhouse, 1979N2, Chromosorb W; Column length: 2. m; Program: not specified
PackedOV-13140.Berninger, Grunnagel, et al., 1975N2, Chromosorb G, AW-DMCS; Column length: 2. m; Program: not specified
PackedOV-13120.Berninger, Grunnagel, et al., 1975N2, Chromosorb G, AW-DMCS; Column length: 2. m; Program: not specified

Van Den Dool and Kratz RI, non-polar column, temperature ramp

View large format table.

Column type Active phase I Reference Comment
CapillarySPB-13119.Christ, Noomano, et al., 198830. m/0.75 mm/1.0 μm, He, 10. K/min, 280. C @ 12. min; Tstart: 160. C
CapillaryCBP-13074.Oyama, Sano, et al., 1987N2, 6. K/min; Column length: 12. m; Column diameter: 0.53 mm; Tstart: 120. C; Tend: 250. C
CapillaryDB-13109.Perrigo, Peel, et al., 198515. m/0.32 mm/0.25 μm, He, 8. K/min, 280. C @ 5. min; Tstart: 120. C
CapillaryDB-13109.Perrigo, Ballantyne, et al., 198415. m/0.25 mm/0.25 μm, He, 8. K/min, 280. C @ 5. min; Tstart: 120. C
PackedSE-303120.Perrigo and Peel, 1981N2, Chromosorb W, 130. C @ 2. min, 8. K/min, 290. C @ 8. min; Column length: 1.8 m

Van Den Dool and Kratz RI, non-polar column, custom temperature program

View large format table.

Column type Active phase I Reference Comment
CapillaryMethyl Silicone3116.University Centre for Pharmacy, 200312.5 m/0.32 mm/1.5 μm; Program: 135C(4min) => 13C/min => 200C => 8C/min => 240C => 6C/min => 312C (6min)
CapillaryCP Sil 5 CB3146.Aderjan and Bogusz, 198810. m/0.53 mm/5.0 μm, He; Program: 100 0C (2 min ) 15 0C/min -> 200 0C 10 0C/min -> 300 0C (8 min hold)
CapillaryBP-13109.Stowell and Wilson, 198712. m/0.22 mm/0.25 μm, He; Program: 120C => 8C/min => 270C => 25C/min => 300C

Normal alkane RI, non-polar column, temperature ramp

View large format table.

Column type Active phase I Reference Comment
CapillaryOV-13119.Schutz and Wollrab A., 198816. K/min; Tstart: 200. C; Tend: 280. C
PackedOV-13115.Marozzi, Gambaro, et al., 1982Gas Chrom P, 5. K/min; Column length: 2. m; Tstart: 150. C; Tend: 300. C
PackedSE-303145.Marozzi, Gambaro, et al., 1982Gas Chrom P, 5. K/min; Column length: 2. m; Tstart: 150. C; Tend: 300. C
PackedSE-303120.Peel and Perrigo, 1976Nitrogen, Chromosorb W AW DMS (80-100 mesh), 130. C @ 2. min, 8. K/min, 290. C @ 8. min; Column length: 2. m
PackedSE-303120.Peel and Perrigo, 1975N2, Chromosorb W AW DMS, 130. C @ 2. min, 8. K/min, 290. C @ 8. min; Column length: 2. m

Normal alkane RI, non-polar column, custom temperature program

View large format table.

Column type Active phase I Reference Comment
CapillaryCP Sil 5 CB3110.Bogusz, Bialka, et al., 198610. m/0.53 mm/5.2 μm; Program: 100 0C (2 min) 20 0C/min -> 180 0C 7.5 0C/min -> 280 0C (6 min)
CapillaryCP Sil 5 CB3119.Bogusz, Bialka, et al., 198610. m/0.53 mm/5.2 μm; Program: not specified
CapillaryBP-13109.Stowell and Wilson, 198512. m/0.22 mm/0.25 μm, He; Program: 120 0X 8 0C/min -> 270 0C 25 0C/min -> 300 0C (5 min)
CapillaryBP-13109.Stowell and Wilson, 198512. m/0.22 mm/0.25 μm, He; Program: 120 0X 8 0C/min -> 270 0C 25 0C/min -> 300 0C (5 min)
CapillaryBP-13110.Stowell and Wilson, 198512. m/0.22 mm/0.25 μm, He; Program: 120 0X 8 0C/min -> 270 0C 25 0C/min -> 300 0C (5 min)
CapillaryBP-13111.Stowell and Wilson, 198512. m/0.22 mm/0.25 μm, He; Program: 120 0X 8 0C/min -> 270 0C 25 0C/min -> 300 0C (5 min)
OtherMethyl Silicone3119.Ardrey and Moffat, 1981Program: not specified

References

Japp, Gill, et al., 1987
Japp, M.; Gill, R.; Osselton, M.D., Comparison of drug retention indices determined on packed, wide bore capillary and narrow bore capillary columns, J. Forensic Sci., 1987, 32, 6, 1574-1586. [all data]

Musumarra, Scarlata, et al., 1987
Musumarra, G.; Scarlata, G.; Romano, G.; Cappello, G.; Clementi, S.; Giulietti, G., Qualitative organic analysis. Part 2. Identification of drugs by principal components analysis of standardized TLC data in four eluent systems and of retention indices on SE 30, J. Anal. Toxicol., 1987, 11, 4, 154-163, https://doi.org/10.1093/jat/11.4.154 . [all data]

Berninger and Möller, 1977
Berninger, H.; Möller, M.R., Retentionsindices zur gaschromatographischen Identifizierung von Arzneimitteln, Arch. Toxicol., 1977, 37, 4, 295-305, https://doi.org/10.1007/BF00330821 . [all data]

Schepers, Wijsbeek, et al., 1982
Schepers, P.; Wijsbeek, J.; Franke, J.P.; de Zeeuw, R.A., Applicability of capillary gas chromatography to substance identification in toxicology by means of retention indices, J. Forensic Sci., 1982, 27, 1, 49-60. [all data]

McLinden and Stenhouse, 1979
McLinden, V.J.; Stenhouse, A.M., A chromatography system for drug identification, Forensic Sci. Int., 1979, 13, 71-79, https://doi.org/10.1016/0379-0738(79)90265-2 . [all data]

Berninger, Grunnagel, et al., 1975
Berninger, H.; Grunnagel, R.; Mall, S.; Moller, M.R., Gas chromatographic identification of unknown substances from body fluids by menas of retention indices, Beitr. Gerichtl. Med., 1975, 33, 185-191. [all data]

Christ, Noomano, et al., 1988
Christ, D.W.; Noomano, P.; Rosas, M.; Rhone, D., Retention indices by wide-bore capillary gas chromatography with nitrogen-phosphorus detection, J. Anal. Toxicol., 1988, 12, 2, 84-88, https://doi.org/10.1093/jat/12.2.84 . [all data]

Oyama, Sano, et al., 1987
Oyama, N.; Sano, T.; Syoyama, M.; Maeda, K., Studies on systematic analysis of poisonous compounds in forensic chemistry. II. Application of capillary column gas chromatography to substance identification by means of retention indices, Eisei Kagaku, 1987, 33, 5, 342-348, https://doi.org/10.1248/jhs1956.33.342 . [all data]

Perrigo, Peel, et al., 1985
Perrigo, B.J.; Peel, H.W.; Ballantyne, D.J., Use of Dual-Column Fused-Silica Capillary Gas Chromatography in Combination with Detector Response Factors for Analytical Toxicology., J. Chromatogr., 1985, 341, 81-88, https://doi.org/10.1016/S0378-4347(00)84011-6 . [all data]

Perrigo, Ballantyne, et al., 1984
Perrigo, B.J.; Ballantyne, D.J.; Peel, H.W., Condierations in developing a data base for drugs on a DBI capillary column, J. Can. Soc. Forensic Sci., 1984, 17, 2, 41-49, https://doi.org/10.1080/00085030.1984.10757360 . [all data]

Perrigo and Peel, 1981
Perrigo, B.J.; Peel, H.W., The use of retention indices and temperature-programmed gas chromatography in analytical toxicology, J. Chromatogr. Sci., 1981, 19, 5, 219-226, https://doi.org/10.1093/chromsci/19.5.219 . [all data]

University Centre for Pharmacy, 2003
University Centre for Pharmacy, University of Groninger, Systematic toxicological analysis, 2003, retrieved from http://www.farm.rug.nl/InterACT/wijopnet.html. [all data]

Aderjan and Bogusz, 1988
Aderjan, R.; Bogusz, M., Nitroalkanes as a multidetector retention index scale for drug identification in gas chromatography, J. Chromatogr., 1988, 454, 345-351, https://doi.org/10.1016/S0021-9673(00)88629-X . [all data]

Stowell and Wilson, 1987
Stowell, A.; Wilson, L.W., A simple approach to the interlaboratory transfer of drug retention indices determined by temperature programmed capillary gas chromatography, J. Forensic Sci., 1987, 32, 5, 1214-1220. [all data]

Schutz and Wollrab A., 1988
Schutz, H.; Wollrab A., The significance of the retention index in toxicologic analysis II, Pharmazie in unzerer Zeit, 1988, 17, 4, 97-101. [all data]

Marozzi, Gambaro, et al., 1982
Marozzi, E.; Gambaro, V.; Saligari, E.; Mariani, R.; Lodi, F., Use of the retention index in gas chromatographic studies of drugs, J. Anal. Toxicol., 1982, 6, 4, 185-192, https://doi.org/10.1093/jat/6.4.185 . [all data]

Peel and Perrigo, 1976
Peel, H.W.; Perrigo, B., A practical gas chromatographic screening procedure for toxicological analysis, Can. Soc. Forens. Sci. J., 1976, 9, 2, 69-74, https://doi.org/10.1080/00085030.1976.10757247 . [all data]

Peel and Perrigo, 1975
Peel, H.W.; Perrigo, B., A practical gas chromatographic screening procedure for toxicological analysis, Can.Soc.Forens.Sci.J., 1975, 9, 2, 69-74, https://doi.org/10.1080/00085030.1976.10757247 . [all data]

Bogusz, Bialka, et al., 1986
Bogusz, M.; Bialka, J.; Gierz, J.; Klys, M., Use of short, wide-bore capillary columns in GC toxicological screening, J. Anal. Toxicol., 1986, 10, 4, 135-138, https://doi.org/10.1093/jat/10.4.135 . [all data]

Stowell and Wilson, 1985
Stowell, A.; Wilson, L., Use of retention indices in drug screening by capillary gas chromatography, Rep. # CD 2362, Department of Scientific and Industrial Reseach, Chemistry Division, Lower Hutt, NZ, 1985, 32. [all data]

Ardrey and Moffat, 1981
Ardrey, R.E.; Moffat, A.C., Gas-liquid chromatographic retention indices of 1318 substances of toxicological interest on SE-30 or OV-1 stationary phase, J. Chromatogr., 1981, 220, 3, 195-252, https://doi.org/10.1016/S0021-9673(00)81925-1 . [all data]