Octadecanoic acid

Van Den Dool and Kratz RI, polar column, temperature ramp

Data compiled by: NIST Mass Spectrometry Data Center, William E. Wallace, director

Column type CapillaryCapillary
Active phase DB-WaxDB-Wax
Column length (m) 60.60.
Carrier gas HeHe
Substrate
Column diameter (mm) 0.250.25
Phase thickness (μm)  0.25
Tstart (C) 60.50.
Tend (C) 220.230.
Heat rate (K/min) 3.2.
Initial hold (min) 4.
Final hold (min) 30.60.
I 3181.3136.
ReferenceChung, Eiserich, et al., 1994Shiratsuchi, Shimoda, et al., 1994
Comment MSDC-RI MSDC-RI

Van Den Dool and Kratz RI, non-polar column, temperature ramp

Data compiled by: NIST Mass Spectrometry Data Center, William E. Wallace, director

Column type CapillaryCapillaryCapillaryCapillaryCapillary
Active phase HP-5MSDB-5DB-5DB-1HP-5
Column length (m) 30.30.30.30.25.
Carrier gas HeHeHeHeHe
Substrate
Column diameter (mm) 0.250.320.320.250.25
Phase thickness (μm) 0.250.250.250.250.25
Tstart (C) 60.40.40.60.60.
Tend (C) 250.250.250.240.240.
Heat rate (K/min) 2.5.5.4.4.
Initial hold (min) 8.2.2.
Final hold (min) 30.5.5.
I 2188.2158.2162.2187.2178.
ReferenceBenkaci-Ali, Baaliouamer, et al., 2007Wu, Zorn, et al., 2007Wu, Zorn, et al., 2007Rezazadeh, Hamedani, et al., 2006Rezazadeh, Hamedani, et al., 2006
Comment MSDC-RI MSDC-RI MSDC-RI MSDC-RI MSDC-RI
Column type CapillaryCapillaryCapillaryCapillaryCapillary
Active phase HP-5MSDB-5DB-5HP-5MSSE-30
Column length (m) 30.30.25.30.30.
Carrier gas H2H2N2HeHe
Substrate
Column diameter (mm) 0.250.250.250.250.25
Phase thickness (μm) 0.250.250.250.250.25
Tstart (C) 50.35.75.60.60.
Tend (C) 285.270.210.250.280.
Heat rate (K/min) 4.35.3.4.16.
Initial hold (min)   10.2.3.
Final hold (min)  20.1.20.10.
I 2180.2180.2166.2172.2174.
ReferenceVujisic L., Vuckovic I., et al., 2006Alves, Pinto, et al., 2005bin Jantan, Yalvema, et al., 2005Pino, Mesa, et al., 2005Tundis, Passalacqua, et al., 2005
Comment MSDC-RI MSDC-RI MSDC-RI MSDC-RI MSDC-RI
Column type CapillaryCapillaryCapillaryCapillaryCapillary
Active phase DB-5SPB-5SPB-5SPB-5SPB-5
Column length (m) 30.30.30.30.30.
Carrier gas HeHeHeHeHe
Substrate
Column diameter (mm) 0.320.250.250.250.25
Phase thickness (μm) 0.250.250.250.250.25
Tstart (C) 40.60.60.60.60.
Tend (C) 250.250.250.250.250.
Heat rate (K/min) 5.4.4.4.4.
Initial hold (min) 2.2.2.2.2.
Final hold (min) 5.20.20.20.20.
I 2157.2172.2172.2173.2172.
ReferenceWu, Zorn, et al., 2005Píno, Marbot, et al., 2004Pino, Marbot, et al., 2004Pino, Marbot, et al., 2004, 2Pino, Marbot, et al., 2003
Comment MSDC-RI MSDC-RI MSDC-RI MSDC-RI MSDC-RI
Column type CapillaryCapillaryCapillaryCapillaryCapillary
Active phase HP-5SPB-5HP-5MSUltra-1DB-1
Column length (m) 30.30.30.25.30.
Carrier gas N2HeHeHe
Substrate
Column diameter (mm) 0.250.250.250.320.2
Phase thickness (μm) 0.250.250.250.520.25
Tstart (C) 60.60.60.35.50.
Tend (C) 220.250.280.320.300.
Heat rate (K/min) 5.4.4.15.5.
Initial hold (min) 10.2.5. 2.
Final hold (min)  20. 10.5.
I 2164.2172.2178.2139.2142.
ReferenceFlamini, Cioni, et al., 2002Pino, Marbot, et al., 2002Skaltsa, Mavrommati, et al., 2001Richmond and Pombo-Villar, 1998Johnson, Urso, et al., 1997
Comment MSDC-RI MSDC-RI MSDC-RI MSDC-RI MSDC-RI
Column type CapillaryPacked
Active phase Ultra-1SE-30
Column length (m) 25.1.8
Carrier gas  N2
Substrate  Chromosorb W
Column diameter (mm) 0.32
Phase thickness (μm) 0.52
Tstart (C) 35.130.
Tend (C) 320.290.
Heat rate (K/min) 15.8.
Initial hold (min)  2.
Final hold (min) 10.8.
I 2138.542175.
ReferenceRichmond and Pombo-Villar, 1997Perrigo and Peel, 1981
Comment MSDC-RI MSDC-RI

Normal alkane RI, polar column, temperature ramp

Data compiled by: NIST Mass Spectrometry Data Center, William E. Wallace, director

Column type CapillaryCapillaryCapillaryCapillary
Active phase DB-WaxTC-WAX FFSTC-WaxDB-Wax
Column length (m) 60.60.60.30.
Carrier gas H2HeHeHe
Substrate
Column diameter (mm) 0.320.250.250.25
Phase thickness (μm) 0.25
Tstart (C) 40.60.80.60.
Tend (C) 230.240.250.240.
Heat rate (K/min) 4.3.4.3.
Initial hold (min) 5.  10.
Final hold (min) 25. 47.
I 3132.3120.3130.3104.
ReferenceDregus and Engel, 2003Miyazawa, Maehara, et al., 2002Miyazawa, Kurose, et al., 2001Hatsuko, Kazuko, et al., 1992
Comment MSDC-RI MSDC-RI MSDC-RI MSDC-RI

References

Chung, Eiserich, et al., 1994
Chung, T.Y.; Eiserich, J.P.; Shibamoto, T., Volatile compounds produced from peanut oil heated with different amounts of cysteine, J. Agric. Food Chem., 1994, 42, 8, 1743-1746, https://doi.org/10.1021/jf00044a032 . [all data]

Shiratsuchi, Shimoda, et al., 1994
Shiratsuchi, H.; Shimoda, M.; Imayoshi, K.; Noda, K.; Osajima, Y., Volatile flavor compounds in spray-dried skim milk powder, J. Agric. Food Chem., 1994, 42, 4, 984-988, https://doi.org/10.1021/jf00040a028 . [all data]