Cholestan-6-one, (5α)-

Reaction thermochemistry data

Data compiled by: Hussein Y. Afeefy, Joel F. Liebman, and Stephen E. Stein

Individual Reactions

Cholestan-6-one, (5α)- = Cholestan-6-one, (5.beta.)-

By formula: C27H46O = C27H46O

Quantity Value Units Method Reference Comment
Δr4.39kJ/molEqkAllinger, Lane, et al., 1974liquid phase; solvent: Ethanol; Heat of isomerization at 25 C

References

Allinger, Lane, et al., 1974
Allinger, N.L.; Lane, G.A.; Wang, G.L., Conformational analysis. XCIX. The 1-decalone ring system, J. Org. Chem., 1974, 39, 704-708. [all data]