1,2-Dioxane

Gas phase ion energetics data

Data compiled as indicated in comments:
LLK - Sharon G. Lias, Rhoda D. Levin, and Sherif A. Kafafi

Ionization energy determinations

IE (eV) Method Reference Comment
10.0PECoughlin, Brown, et al., 1979Vertical value; LLK

References

Coughlin, Brown, et al., 1979
Coughlin, D.J.; Brown, R.S.; Salomon, R.G., The prostaglandin endoperoxide nucleus and related bicyclic peroxides. Synthetic and spectroscopic studies, J. Am. Chem. Soc., 1979, 101, 1533. [all data]