Ethiofencarb

Normal alkane RI, polar column, custom temperature program

Data compiled by: NIST Mass Spectrometry Data Center, William E. Wallace, director

Column type Capillary
Active phase Carbowax 20M
Column length (m)
Carrier gas
Substrate
Column diameter (mm)
Phase thickness (μm)
Program not specified
I 2378.
ReferenceTameo and Kiyos, 1991
Comment MSDC-RI

References

Tameo and Kiyos, 1991
Tameo, O.; Kiyos, I., Simultaneous determination of pesticides by capillary gas chromatography, Cannot be traslated (in Japan), 1991, 14, 2, 109-122. [all data]