1,6-Methano-1H-indene, 2,3,3a,4,5,8-hexachloro-3a,6,7,7a-tetrahydro-, (1-α,3a-β,6-α,7a-β,8R*)-

Van Den Dool and Kratz RI, non-polar column, temperature ramp

View large format table.

Column type Active phase I Reference Comment
CapillaryCP Sil 5 CB1902.Wells, Gillespie, et al., 1985120. C @ 1. min, 3. K/min; Column length: 25. m; Column diameter: 0.22 mm; Tend: 250. C

Normal alkane RI, non-polar column, temperature ramp

View large format table.

Column type Active phase I Reference Comment
CapillaryHP-11917.4Dearth and Hites, 1991H2, 50. C @ 1. min, 3. K/min; Column length: 30. m; Column diameter: 0.25 mm; Tend: 320. C
CapillaryDB-51959.6Dearth and Hites, 1991H2, 50. C @ 1. min, 3. K/min; Column length: 30. m; Column diameter: 0.25 mm; Tend: 320. C

Normal alkane RI, polar column, custom temperature program

View large format table.

Column type Active phase I Reference Comment
CapillaryCarbowax 20M2628.Tameo and Kiyos, 1991Program: not specified

References

Wells, Gillespie, et al., 1985
Wells, D.E.; Gillespie, M.J.; Porter, A.E.A., Dichlorobenzyl alkyl ether homologs as retention index markers and internal standards for the analysis of environmental samples using capillary gas chromatography, J. Hi. Res. Chromatogr. Chromatogr. Comm., 1985, 8, 8, 443-449, https://doi.org/10.1002/jhrc.1240080818 . [all data]

Dearth and Hites, 1991
Dearth, M.A.; Hites, R.A., Complete analysis of technical chlordane using negative ionization mass spectrometry, Environ. Sci. Technol., 1991, 25, 2, 245-254, https://doi.org/10.1021/es00014a005 . [all data]

Tameo and Kiyos, 1991
Tameo, O.; Kiyos, I., Simultaneous determination of pesticides by capillary gas chromatography, Cannot be traslated (in Japan), 1991, 14, 2, 109-122. [all data]