3,3-Tetramethyleneglutaric anhydride

Phase change data

Data compiled by: William E. Acree, Jr., James S. Chickos

Quantity Value Units Method Reference Comment
Δsub96.4 ± 1.1kJ/molCMatos, Miranda, et al., 2008

Enthalpy of fusion

ΔfusH (kJ/mol) Temperature (K) Method Reference
15.3338.4DSCMatos, Miranda, et al., 2008

References

Matos, Miranda, et al., 2008
Matos, M. Agostinha R.; Miranda, Margarida S.; Fonseca, Diana A.P.; Morais, Victor M.F.; Liebman, Joel F., Calorimetric and Computational Thermochemical Study of 3,3-Tetramethyleneglutaric Acid, 3,3-Tetramethyleneglutaric Anhydride, and 3,3-Tetramethyleneglutarimide, J. Phys. Chem. A, 2008, 112, 40, 10053-10058, https://doi.org/10.1021/jp805292x . [all data]