2-Butenoic acid, 2-methyl-, (Z)-

Gas phase ion energetics data

Data evaluated by: Edward P. Hunter and Sharon G. Lias

Quantity Value Units Method Reference Comment
Proton affinity (review)822.5kJ/molN/AHunter and Lias, 1998
Quantity Value Units Method Reference Comment
Gas basicity791.5kJ/molN/AHunter and Lias, 1998

Phase change data

Data compiled as indicated in comments:
BS - Robert L. Brown and Stephen E. Stein
TRC - Thermodynamics Research Center, NIST Boulder Laboratories, Chris Muzny director
AC - William E. Acree, Jr., James S. Chickos

Quantity Value Units Method Reference Comment
Tboil458.2KN/AWeast and Grasselli, 1989BS
Quantity Value Units Method Reference Comment
Tc661.14KN/AD'Souza and Teja, 1987Uncertainty assigned by TRC = 3. K; Ambrose's procedure; TRC
Quantity Value Units Method Reference Comment
Pc44.3293atmN/AD'Souza and Teja, 1987Uncertainty assigned by TRC = 0.987 atm; Ambrose's procedure; TRC

Reduced pressure boiling point

Tboil (K) Pressure (atm) Reference Comment
361.70.013Weast and Grasselli, 1989BS

Enthalpy of vaporization

ΔvapH (kcal/mol) Temperature (K) Method Reference Comment
14.8376.AStephenson and Malanowski, 1987Based on data from 361. - 458. K.; AC

In addition to the Thermodynamics Research Center (TRC) data available from this site, much more physical and chemical property data is available from the following TRC products:

References

Hunter and Lias, 1998
Hunter, E.P.; Lias, S.G., Evaluated Gas Phase Basicities and Proton Affinities of Molecules: An Update, J. Phys. Chem. Ref. Data, 1998, 27, 3, 413-656, https://doi.org/10.1063/1.556018 . [all data]