2-Methyl-1,3-dithiacyclopentane

Kovats' RI, non-polar column, isothermal

View large format table.

Column type Active phase Temperature (C) I Reference Comment
CapillaryOV-101130.996.Misharina and Golovnya, 1994He; Column length: 50. m; Column diameter: 0.32 mm
CapillaryOV-101150.1014.Misharina and Golovnya, 1994He; Column length: 50. m; Column diameter: 0.32 mm
CapillarySE-52130.1030.Misharina and Golovnya, 199460. m/0.32 mm/2. μm, He
CapillaryOV-101130.996.Misharina, Golovnya, et al., 199350. m/0.32 mm/0.5 μm, He
PackedApiezon M130.1027.Garbuzov, Misharina, et al., 1985He or N2, Chromosorb W, AW-DMCS; Column length: 2.1 m

Van Den Dool and Kratz RI, non-polar column, temperature ramp

View large format table.

Column type Active phase I Reference Comment
CapillaryOV-101973.Misharina and Golovnya, 1994He, 50. C @ 0. min, 4. K/min; Column length: 50. m; Column diameter: 0.32 mm; Tend: 200. C
CapillarySE-521021.Misharina and Golovnya, 199460. m/0.32 mm/2. μm, He, 50. C @ 0. min, 4. K/min; Tend: 200. C
CapillaryDB-1971.Zhang and Ho, 199160. m/0.25 mm/0.25 μm, He, 2. K/min, 220. C @ 10. min; Tstart: 40. C
CapillaryDB-1965.Zhang and Ho, 198960. m/0.25 mm/0.25 μm, He, 2. K/min, 220. C @ 10. min; Tstart: 40. C
CapillaryDB-1958.Zhang, Chien, et al., 198860. m/0.25 mm/0.25 μm, He, 2. K/min, 220. C @ 10. min; Tstart: 40. C

Van Den Dool and Kratz RI, polar column, temperature ramp

View large format table.

Column type Active phase I Reference Comment
CapillaryDB-Wax1438.Chung, Eiserich, et al., 1994He, 60. C @ 4. min, 3. K/min, 220. C @ 30. min; Column length: 60. m; Column diameter: 0.25 mm

Normal alkane RI, non-polar column, temperature ramp

View large format table.

Column type Active phase I Reference Comment
CapillaryDB-1982.Güntert, Bertram, et al., 199260. m/0.32 mm/0.25 μm, He, 3. K/min; Tstart: 60. C; Tend: 220. C

Normal alkane RI, non-polar column, custom temperature program

View large format table.

Column type Active phase I Reference Comment
PackedApiezon M1025.Golovnya, Misharina, et al., 1983N2, Chromosorb W AW/DMCS; Column length: 5.6 m; Program: 60C(7min), 100C(7min), 150C isothermal

References

Misharina and Golovnya, 1994
Misharina, T.A.; Golovnya, R.V., Spectral and gas-chromatographic characterization of 4-methyl-2-alkyl substituted 1,3-oxothiolanes and 1,3-dithiolanes, Zh. Anal. Khim., 1994, 49, 4, 395-401. [all data]

Misharina, Golovnya, et al., 1993
Misharina, T.A.; Golovnya, R.V.; Beletsky, I.V., Sorption properties of heterocyclic compounds differing by heteroatom in capillary gas chromatography, Russ. Chem. Bull. (Engl. Transl.), 1993, 42, 7, 1167-1170, https://doi.org/10.1007/BF00701998 . [all data]

Garbuzov, Misharina, et al., 1985
Garbuzov, V.G.; Misharina, T.A.; Aerov, A.F.; Golovnya, R.V., Gas chromatographic retention indices for sulphur(II)-containing organic substances, J. Anal. Chem. USSR (Engl. Transl.), 1985, 40, 4, 576-586. [all data]

Zhang and Ho, 1991
Zhang, Y.; Ho, C.-T., Comparison of the volatile compounds formed from the thermal reaction of glucose with cysteine and glutathione, J. Agric. Food Chem., 1991, 39, 4, 760-763, https://doi.org/10.1021/jf00004a029 . [all data]

Zhang and Ho, 1989
Zhang, Y.; Ho, C.-T., Volatile compounds formed from thermnal interaction of 2,4-decadienal with cysteine and glutathione, J. Agric. Food Chem., 1989, 37, 4, 1016-1020, https://doi.org/10.1021/jf00088a044 . [all data]

Zhang, Chien, et al., 1988
Zhang, Y.; Chien, M.; Ho.C.-T., Comparison of the volatile compounds obtained from thermal degradation of cysteine and glutathione in water, J. Agric. Food Chem., 1988, 36, 5, 992-996, https://doi.org/10.1021/jf00083a022 . [all data]

Chung, Eiserich, et al., 1994
Chung, T.Y.; Eiserich, J.P.; Shibamoto, T., Volatile compounds produced from peanut oil heated with different amounts of cysteine, J. Agric. Food Chem., 1994, 42, 8, 1743-1746, https://doi.org/10.1021/jf00044a032 . [all data]

Güntert, Bertram, et al., 1992
Güntert, M.; Bertram, H.-J.; Hopp, R.; Silberzahn, W.; Sommer, H.; Werkhoff, P., Thermal generation of flavor compounds from thiamin and various amino acids in Recent developments in flavor and fragrance chemistry. Proceedings of the 3rd International Haarmann Reimer Symposium, Hopp,R.; Mori,K., ed(s)., VCH Publishers, New York, 1992, 215-240. [all data]

Golovnya, Misharina, et al., 1983
Golovnya, R.V.; Misharina, T.A.; Garbuzov, V.G.; Medvedyev, F.A., Volatile sulfur containing compounds in simulated meat flavour and their comparison with the constituents of natural aroma, Nahrung, 1983, 27, 3, 237-249, https://doi.org/10.1002/food.19830270314 . [all data]