Cyclopropanecarbonitrile, 2-phenyl-, trans-

Kovats' RI, non-polar column, isothermal

Data compiled by: NIST Mass Spectrometry Data Center, William E. Wallace, director

Column type Packed
Active phase SE-30
Column length (m) 3.
Carrier gas N2
Substrate Chromosorb W AW (0.20-0.25 mm)
Column diameter (mm)
Phase thickness (μm)
Temperature (C) 170.
I 1351.
ReferenceHeintz, Druilhe, et al., 1977
Comment MSDC-RI

References

Heintz, Druilhe, et al., 1977
Heintz, M.; Druilhe, A.; De Peretti, D.; Seyden, J.; Lefort, D., Relations entre structure chimique et grandeurs de retention. VII. Composés de structure cyclopropanique, Chromatographia, 1977, 10, 10, 588-592, https://doi.org/10.1007/BF02265036 . [all data]