3-Nitrocinnamic acid

Condensed phase thermochemistry data

Data compiled as indicated in comments:
ALS - Hussein Y. Afeefy, Joel F. Liebman, and Stephen E. Stein
DH - Eugene S. Domalski and Elizabeth D. Hearing

Quantity Value Units Method Reference Comment
Δfsolid-370.3kJ/molCcbZavoianu, Ciocazan, et al., 1990ALS
Quantity Value Units Method Reference Comment
Δcsolid-4171.kJ/molCcbZavoianu, Ciocazan, et al., 1990ALS
Δcsolid-4165.39kJ/molCcbVerkade, 1926ALS

Constant pressure heat capacity of solid

Cp,solid (J/mol*K) Temperature (K) Reference Comment
240.2323.Satoh and Sogabe, 1941T = 0 to 100°C. Mean value.; DH

References

Zavoianu, Ciocazan, et al., 1990
Zavoianu, D.; Ciocazan, I.; Moga-Gheorghe, S.; Bornaz, C., Structure and reactivity of acids. Heats of combustion and formation of some phenylacrylic acids., Rev. Chim. (Bucharest), 1990, 41, 234-236. [all data]

Verkade, 1926
Verkade, P.E., Verbrandingswarmten van plaatsings-isomere benzol-derivaten en de theorie der geinduceerde alterneeren de polatiteit, Verslag Akad. Wetenschappen Amsterdam, 1926, 35, 492-504. [all data]

Satoh and Sogabe, 1941
Satoh, S.; Sogabe, T., The heat capacities of some organic compounds containing nitrogen and the atomic heat of nitrogen. (1), Sci., Pap. Inst. Phys. Chem. Res. (Tokyo), 1941, 38, 197-203. [all data]