(1α,2β,5β,6α) 7,8-Diazatricyclo[4.2.2.0(2,5)]deca-7,9-diene N-oxide

Reaction thermochemistry data

Data compiled by: Hussein Y. Afeefy, Joel F. Liebman, and Stephen E. Stein

Individual Reactions

C8H10N2O = Nitrous oxide + Bicyclo[4.2.0]octa-2,4-diene

By formula: C8H10N2O = N2O + C8H10

Quantity Value Units Method Reference Comment
Δr-9.7 ± 0.4kJ/molKinOth, Olsen, et al., 1977gas phase; At 426 K

References

Oth, Olsen, et al., 1977
Oth, J.F.M.; Olsen, H.; Synder, J.P., Energetics of heteroextrusion reactions. N2 vs. N2O, J. Am. Chem. Soc., 1977, 99, 8505-8507. [all data]