2-Hydroxy-2-methylbutyric acid, 2TMS derivative

Van Den Dool and Kratz RI, non-polar column, custom temperature program

Data compiled by: NIST Mass Spectrometry Data Center, William E. Wallace, director

Column type Capillary
Active phase DB-1
Column length (m)
Carrier gas He
Substrate
Column diameter (mm)
Phase thickness (μm)
Program not specified
I 1170.
ReferenceTsai, Oliphant, et al., 1985
Comment MSDC-RI

References

Tsai, Oliphant, et al., 1985
Tsai, M.Y.; Oliphant, C.; Josephson, M.W., Identification of Metabolites Diagnostic for Organic Acidurias by Simultaneous Dual-Column Capillary Gas Chromatography, J. Chromatogr., 1985, 341, 1-10, https://doi.org/10.1016/S0378-4347(00)84004-9 . [all data]