2-Eicosanoylglycerol, 2TMS derivative

Normal alkane RI, non-polar column, custom temperature program

Data compiled by: NIST Mass Spectrometry Data Center, William E. Wallace, director

Column type CapillaryCapillary
Active phase HP-1HP-5
Column length (m) 30.30.
Carrier gas HeHe
Substrate
Column diameter (mm) 0.250.25
Phase thickness (μm) 0.25
Program not specifiednot specified
I 2965.2962.
ReferenceIsidorov, Rusak, et al., 2007Isidorov, Rusak, et al., 2007
Comment MSDC-RI MSDC-RI

References

Isidorov, Rusak, et al., 2007
Isidorov, V.A.; Rusak, M.; Szczepaniak, L.; Witkowski, S., Gas chromatographic retention indices of trimethylsilyl derivatives of mono- and diglycerides on capillary columns with non-polar stationary phases, J. Chromatogr. A, 2007, 1166, 1-2, 207-211, https://doi.org/10.1016/j.chroma.2007.07.047 . [all data]