Indeno[1,2-d]triazol-8(3H)-one,3-butyl-3a,8a-dihydro-

Gas phase ion energetics data

Data compiled by: Sharon G. Lias, Rhoda D. Levin, and Sherif A. Kafafi

Appearance energy determinations

Ion AE (eV) Other Products MethodReferenceComment
C13H15NO+7.8 ± 0.2N2EIHansen and Undheim, 1975

References

Hansen and Undheim, 1975
Hansen, P.E.; Undheim, K., Mass spectrometry of onium compounds. XXIX. Ionisation potential in structure analysis of valence isomers, Acta Chem. Scand., Ser. B, 1975, 29, 221. [all data]