Glycine, N-(1-oxobutyl)-N-(trimethylsilyl)-, trimethylsilyl ester

Van Den Dool and Kratz RI, non-polar column, temperature ramp

Data compiled by: NIST Mass Spectrometry Data Center, William E. Wallace, director

Column type PackedPacked
Active phase OV-1OV-1
Column length (m) 2.1.8
Carrier gas N2N2
Substrate Anakrom100-120 mesh
Column diameter (mm)
Phase thickness (μm)
Tstart (C) 80.70.
Tend (C)  290.
Heat rate (K/min) 4.28.
Initial hold (min)  0.5
Final hold (min)
I 1479.1479.
ReferenceRamsdell and Tanaka, 1980Tanaka, Hine, et al., 1980
Comment MSDC-RI MSDC-RI

Van Den Dool and Kratz RI, non-polar column, custom temperature program

Data compiled by: NIST Mass Spectrometry Data Center, William E. Wallace, director

Column type Packed
Active phase OV-101
Column length (m)
Carrier gas
Substrate
Column diameter (mm)
Phase thickness (μm)
Program not specified
I 1479.
ReferenceTanaka and Hine, 1982
Comment MSDC-RI

References

Ramsdell and Tanaka, 1980
Ramsdell, H.S.; Tanaka, K., Gas chromatographic retention indices of twenty metabolically important acylglycines as trimethylsilyl derivatives, J. Chromatogr., 1980, 181, 1, 90-94, https://doi.org/10.1016/S0378-4347(00)81273-6 . [all data]

Tanaka, Hine, et al., 1980
Tanaka, K.; Hine, D.G.; West-Dull, A.; Lynn, T.B., Gas-chromatographic method of analysis for urinary organic acids. I. Retention indices of 155 metabolically important compounds, Clin. Chem., 1980, 26, 13, 1839-1846. [all data]