Campesterol, TMS derivative

Van Den Dool and Kratz RI, non-polar column, temperature ramp

View large format table.

Column type Active phase I Reference Comment
CapillaryDB-5MS3249.5Jonsson, Johansson, et al., 200510. m/0.18 mm/0.18 μm, 70. C @ 2. min, 40. K/min, 320. C @ 2. min

Normal alkane RI, non-polar column, temperature ramp

View large format table.

Column type Active phase I Reference Comment
CapillaryRTX-5 Sil MS3263.Lytovchenko, Beleggia, et al., 200930. m/0.25 mm/0.25 μm, Helium, 70. C @ 5. min, 5. K/min, 310. C @ 1. min
CapillaryHP-53253.Isidorov, Lech, et al., 200830. m/0.25 mm/0.25 μm, Helium, 3. K/min, 300. C @ 30. min; Tstart: 50. C
CapillaryDB-5MS3204.Rogge, Medeiros, et al., 200630. m/0.25 mm/0.25 μm, He, 60. C @ 2. min, 6. K/min, 300. C @ 15. min

References

Jonsson, Johansson, et al., 2005
Jonsson, P.; Johansson, A.I.; Gullberg, J.; Trygg, J.; Jiye, A.; Grung, B.; Marklund, S.; Sjöström, M.; Antti, H.; Moritz, T., High-throughput data analysis for detecting and identifying differences between samples in GC/MS-based metabolomic analyses, Anal. Chem., 2005, 77, 17, 5635-5642, https://doi.org/10.1021/ac050601e . [all data]

Lytovchenko, Beleggia, et al., 2009
Lytovchenko, A.; Beleggia, R.; Schauer, N.; Isaacson, T.; Leuendorf, J.E.; Hellmann, H.; Rose, J.K.C.; Fernie, A.R., Application of GC-MS fpr the detection of lipophilic compounds in diverse plant tissues, Plant Methods, 2009, 5, 4, 1-11. [all data]

Isidorov, Lech, et al., 2008
Isidorov, V.A.; Lech, P.; Zolciak, A.; Rusak, N.; Szczepaniak, L., Gas Chromatographic - nass spectrometric investigation of metabolites from the needles and roots of pine seedlings at early stages of pathogenic fungi Armillaria ostoyae attack, Trees, 2008, 22, 4, 531-542, https://doi.org/10.1007/s00468-008-0213-z . [all data]

Rogge, Medeiros, et al., 2006
Rogge, W.F.; Medeiros, P.M.; Simoneit, B.R.T., Organic marker compounds for surface soil and fugitive dust from open lot dairies and cattle feedlots, Atmos. Environ., 2006, 40, 1, 27-49, https://doi.org/10.1016/j.atmosenv.2005.07.076 . [all data]