Arsenous acid, tris(trimethylsilyl) ester

Normal alkane RI, non-polar column, temperature ramp

View large format table.

Column type Active phase I Reference Comment
PackedSE-301149.Butts and Rainey, 19715. K/min; Tstart: 70. C; Tend: 150. C

References

Butts and Rainey, 1971
Butts, W.C.; Rainey, W.T., Jr., Gas Chromatography and Mass Spectrometry of the Trimethylsilyl Derivatives of Inorganic Anions, Anal. Chem., 1971, 43, 4, 538-542, https://doi.org/10.1021/ac60299a004 . [all data]