Docosane, 11-decyl-

Phase change data

Data compiled as indicated in comments:
TRC - Thermodynamics Research Center, NIST Boulder Laboratories, Chris Muzny director
AC - William E. Acree, Jr., James S. Chickos

Quantity Value Units Method Reference Comment
Tfus274.2KN/ASchiessler, 1947Uncertainty assigned by TRC = 1. K; TRC
Tfus274.2KN/AWhitmore, Sutherland, et al., 1942Uncertainty assigned by TRC = 2. K; TRC

Enthalpy of vaporization

ΔvapH (kcal/mol) Temperature (K) Method Reference Comment
25.98538.A,MGStephenson and Malanowski, 1987Based on data from 523. - 559. K. See also Schiessler and Whitmore, 1955.; AC

In addition to the Thermodynamics Research Center (TRC) data available from this site, much more physical and chemical property data is available from the following TRC products:

References

Schiessler, 1947
Schiessler, R.W., , Am. Pet. Inst. Res. Proj. 42, Twelfth Meeting, 1947. [all data]

Whitmore, Sutherland, et al., 1942
Whitmore, F.C.; Sutherland, L.H.; Cosby, J.N., Higher Hydrocarbons. I. Seven Alkyl Substituted Docosanes., J. Am. Chem. Soc., 1942, 64, 1360. [all data]

Stephenson and Malanowski, 1987
Stephenson, Richard M.; Malanowski, Stanislaw, Handbook of the Thermodynamics of Organic Compounds, 1987, https://doi.org/10.1007/978-94-009-3173-2 . [all data]

Schiessler and Whitmore, 1955
Schiessler, R.W.; Whitmore, F.C., Properties of High Molecular Weight Hydrocarbons, Ind. Eng. Chem., 1955, 47, 8, 1660-1665, https://doi.org/10.1021/ie50548a054 . [all data]