Galactonic acid, hexakis-TMS

Kovats' RI, non-polar column, isothermal

View large format table.

Column type Active phase Temperature (C) I Reference Comment
PackedOV-1160.2062.Petersson, 1977N2, Chromosorb G (100-120 mesh); Column length: 2. m

Van Den Dool and Kratz RI, non-polar column, temperature ramp

View large format table.

Column type Active phase I Reference Comment
CapillaryRTX-5Sil MS1991.7Wagner, Sefkow, et al., 2003He, 80. C @ 2. min, 18. K/min, 350. C @ 2. min; Column length: 30. m; Column diameter: 0.25 mm
CapillaryRTX-5Sil1991.6Wagner, Sefkow, et al., 200380. C @ 2. min, 18. K/min, 350. C @ 2. min; Column length: 30. m; Column diameter: 0.25 mm
CapillaryUltra-22039.Tuchman, Bowers, et al., 198425. m/0.31 mm/0.52 μm, He, 5. K/min; Tstart: 50. C; Tend: 300. C

References

Petersson, 1977
Petersson, G., Retention Data in GLC Analysis; Carbohydrate-Related Hydroxy Carboxylic and Dicarboxylic Acids as Trimethylsilyl Derivatives, J. Chromatogr. Sci., 1977, 15, 7, 245-255, https://doi.org/10.1093/chromsci/15.7.245 . [all data]

Wagner, Sefkow, et al., 2003
Wagner, C.; Sefkow, M.; Kopka, J., Construction and application of a mass spectral and retention time index database generated from plant GC/EI-TOF-MS metabolite profiles, Phytochemistry, 2003, 62, 6, 887-900, https://doi.org/10.1016/S0031-9422(02)00703-3 . [all data]

Tuchman, Bowers, et al., 1984
Tuchman, M.; Bowers, L.D.; Fregien, K.D.; Crippin, P.J.; Krivit, W., Capillary Gas Chromatographic Separation of Urinary Organic Acids. Retention Indices of 101 Urinary Acids on a 5% Phenylmethyl Silicone Capillary Column, J. Chromatogr. Sci., 1984, 22, 5, 198-202, https://doi.org/10.1093/chromsci/22.5.198 . [all data]