Benzenepropanoic acid, α-hydroxy-4-methoxy-, methyl ester

Normal alkane RI, non-polar column, temperature ramp

Data compiled by: NIST Mass Spectrometry Data Center, William E. Wallace, director

Column type Capillary
Active phase OV-101
Column length (m) 25.
Carrier gas He
Substrate
Column diameter (mm)
Phase thickness (μm)
Tstart (C) 75.
Tend (C) 280.
Heat rate (K/min) 2.
Initial hold (min) 7.
Final hold (min)
I 1595.
ReferenceSpiteller and Spiteller, 1979
Comment MSDC-RI

References

Spiteller and Spiteller, 1979
Spiteller, M.; Spiteller, G., Trennung und charakterisierung saurer harnbest and- teile, J. Chromatogr., 1979, 164, 3, 253-317, https://doi.org/10.1016/S0378-4347(00)81232-3 . [all data]