Docosane, 5-butyl-

Condensed phase thermochemistry data

Data compiled by: Hussein Y. Afeefy, Joel F. Liebman, and Stephen E. Stein

Quantity Value Units Method Reference Comment
Δfliquid-715.5kJ/molCcbKnowlton and Huffman, 1944
Quantity Value Units Method Reference Comment
Δcliquid-17235.2 ± 6.7kJ/molCcbKnowlton and Huffman, 1944Reanalyzed by Cox and Pilcher, 1970, Original value = -17234. kJ/mol; Corresponding Δfliquid = -713.54 kJ/mol (simple calculation by NIST; no Washburn corrections)

Gas phase thermochemistry data

Data compiled by: Hussein Y. Afeefy, Joel F. Liebman, and Stephen E. Stein

Quantity Value Units Method Reference Comment
Δfgas-140.4 ± 1.8kcal/molCcbKnowlton and Huffman, 1944Heat of formation derived by Cox and Pilcher, 1970

Phase change data

Data compiled as indicated in comments:
BS - Robert L. Brown and Stephen E. Stein
TRC - Thermodynamics Research Center, NIST Boulder Laboratories, Chris Muzny director
ALS - Hussein Y. Afeefy, Joel F. Liebman, and Stephen E. Stein
AC - William E. Acree, Jr., James S. Chickos

Quantity Value Units Method Reference Comment
Tfus294.0KN/AWhitmore, Sutherland, et al., 1942Uncertainty assigned by TRC = 0.5 K; TRC
Quantity Value Units Method Reference Comment
Δvap30.1 ± 0.2kcal/molEKnowlton and Huffman, 1944Heat of formation derived by Cox and Pilcher, 1970; ALS

Reduced pressure boiling point

Tboil (K) Pressure (atm) Reference Comment
517.20.013Weast and Grasselli, 1989BS

Enthalpy of vaporization

ΔvapH (kcal/mol) Temperature (K) Method Reference Comment
22.5497.A,MGStephenson and Malanowski, 1987Based on data from 482. - 518. K. See also Schiessler and Whitmore, 1955.; AC

In addition to the Thermodynamics Research Center (TRC) data available from this site, much more physical and chemical property data is available from the following TRC products:

References

Knowlton and Huffman, 1944
Knowlton, J.W.; Huffman, H.M., The heats of combustion of some substituted eicosanes, heneicosanes and docosanes, J. Am. Chem. Soc., 1944, 66, 1492-1494. [all data]

Cox and Pilcher, 1970
Cox, J.D.; Pilcher, G., Thermochemistry of Organic and Organometallic Compounds, Academic Press, New York, 1970, 1-636. [all data]