Lupanine

Van Den Dool and Kratz RI, non-polar column, temperature ramp

View large format table.

Column type Active phase I Reference Comment
CapillaryHP-5MS2159.Guimaraes P.R., Jose J., et al., 200330. m/0.25 mm/0.25 μm, He, 4. K/min; Tstart: 70. C; Tend: 300. C

Normal alkane RI, non-polar column, temperature ramp

View large format table.

Column type Active phase I Reference Comment
CapillaryOV-12165.Martins, Wink, et al., 2005He, 120. C @ 3. min, 8. K/min; Column length: 30. m; Column diameter: 0.25 mm; Tend: 300. C
CapillaryDB-52165.Przybylak, Ciesiolka, et al., 2005He, 180. C @ 2. min, 5. K/min, 300. C @ 10. min; Column length: 30. m; Column diameter: 0.25 mm
CapillaryDB-12178.Kite and Pennington, 200330. m/0.25 mm/0.25 μm, 6. K/min; Tstart: 120. C; Tend: 320. C
CapillaryDB-12185.Torres, Quintos, et al., 200230. m/0.25 mm/0.25 μm, He, 120. C @ 3. min, 10. K/min, 260. C @ 10. min
CapillaryOV-12193.Woldemichael and Wink, 200230. m/0.32 mm/0.25 μm, He, 70. C @ 3. min, 6. K/min; Tend: 300. C
CapillaryDB-12170.Martínez-Herrera, Robledo-Quintos, et al., 200130. m/0.25 mm/0.25 μm, He, 2. K/min, 280. C @ 15. min; Tstart: 150. C
CapillaryDB-12160.Greinwald, Bachmann, et al., 1995He, 6. K/min; Column length: 30. m; Column diameter: 0.32 mm; Tstart: 150. C; Tend: 300. C
CapillaryDB-12165.Greinwald, Henrichs, et al., 1995He, 6. K/min; Column length: 30. m; Column diameter: 0.32 mm; Tstart: 150. C; Tend: 300. C
CapillaryDB-12165.Kirch, Veit, et al., 1995He, 6. K/min; Column length: 30. m; Column diameter: 0.32 mm; Tstart: 150. C; Tend: 300. C
CapillaryDB-12160.van Wyk, Greinwald, et al., 19956. K/min; Column length: 30. m; Column diameter: 0.32 mm; Tstart: 150. C; Tend: 300. C
CapillaryDB-12165.Planchuelo-Ravelo and Wink, 19936. K/min; Column length: 30. m; Column diameter: 0.3 mm; Tstart: 150. C; Tend: 270. C
CapillaryDB-12160.Greinwald, Canto, et al., 1992He, 6. K/min; Column length: 30. m; Column diameter: 0.32 mm; Tstart: 150. C; Tend: 300. C
CapillaryDB-12165.Wink and Witte, 199130. m/0.32 mm/1.0 μm, Helium, 150. C @ 1. min, 10. K/min; Tend: 300. C
CapillarySE-302170.Wink, Witte, et al., 1983He, 6. K/min; Column length: 15. m; Column diameter: 0.26 mm; Tstart: 150. C; Tend: 270. C
CapillarySE-302165.Wink, Witte, et al., 1981He, 6. K/min; Column length: 15. m; Column diameter: 0.26 mm; Tstart: 150. C; Tend: 270. C

Normal alkane RI, non-polar column, custom temperature program

View large format table.

Column type Active phase I Reference Comment
CapillaryDB-5 MS2165.Cook, Lee, et al., 2009Column length: 30. m; Column diameter: 0.25 mm; Program: 100 0C (1 min) 40 0C/min -> 200 0C 5 0C/min -> 275 0C (15 min)
CapillaryDB-12165.El-Shazly, Ateya, et al., 2001Helium; Column length: 15. m; Column diameter: 0.317 mm; Program: 150 0C (2 min) 15 0C/min -> 250 0C 25 0C/min -> 300 0C (5 min)
CapillaryOV-12165.Asres, Tei, et al., 1997He; Column length: 15. m; Column diameter: 0.25 mm; Program: 120C (2min) => 10C/min => 250C => 15C/min => 300C
CapillaryDB-12160.Greinwald, Ross, et al., 1996He; Column length: 15. m; Column diameter: 0.25 mm; Program: 150C(2min) => 10C/min => 250C => 20C/min => 300C (10min)
CapillaryDB-12165.Greinwald, van Rensen, et al., 1995He; Column length: 30. m; Column diameter: 0.32 mm; Program: 150C (2min) => 10C/min => 250C => 20C/min => 300C (5min)
CapillaryDB-12160.Greinwald, Ross, et al., 1995He; Column length: 30. m; Column diameter: 0.32 mm; Program: 150C (2min) => 10C/min => 250C => 20C/min => 300C (5min)
CapillaryDB-12165.Wink, Meissner, et al., 1995Column length: 30. m; Column diameter: 0.3 mm; Program: not specified
CapillarySE-542170.Detzel and Wink, 199315. m/0.25 mm/0.16 μm, Helium; Program: 150 0C (2 min) 15 0C/min -> 250 0C 25 0C/min -> 200 0C (10 min)
CapillaryDB-12160.Greinwald, Witte, et al., 1991He; Column length: 30. m; Column diameter: 0.32 mm; Program: 150C (2min) => 10C/min => 250C => 20C/min => 300C (5min)

References

Guimaraes P.R., Jose J., et al., 2003
Guimaraes P.R.; Jose J.; Galetti M.; Trigo J.R., Quinolizidine alkaloids in Ormosia arborea seeds inhibit predation but not hoarding by agoutis (Dasyprocta leporina), J. Chem. Ecol., 2003, 29, 5, 1065-1072, https://doi.org/10.1023/A:1023817203748 . [all data]

Martins, Wink, et al., 2005
Martins, A.; Wink, M.; Tei, A.; Brum-Bousquet, M.; Tillequin, F.; Rauter, A.-P., A phytochemical study of the quinolizidine alkaloids from Genista tenera by gas chromatography-mass spectrometry, Phytochem. Anal., 2005, 16, 4, 264-266, https://doi.org/10.1002/pca.832 . [all data]

Przybylak, Ciesiolka, et al., 2005
Przybylak, J.K.; Ciesiolka, D.; Wysocka, W.; García-López, P.M.; Ruiz-López, M.A.; Wysocki, W.; Gulewicz, K., Alkaloid profiles of Mexican wild lupin and an effect of alkaloid preparation from Lupinus exaltatus seeds on growth and yield of paprika (Capsicum annuum L.), Ind. Crops Prod., 2005, 21, 1, 1-7, https://doi.org/10.1016/j.indcrop.2003.12.001 . [all data]

Kite and Pennington, 2003
Kite, G.C.; Pennington, R.T., Quinolizidine alkaloid status of Styphnolobium and Cladrastis (Leguminosae), Biochem. Syst. Ecol., 2003, 31, 12, 1409-1416, https://doi.org/10.1016/S0305-1978(03)00118-2 . [all data]

Torres, Quintos, et al., 2002
Torres, K.B.; Quintos, N.R.; Necha, L.L.B.; Wink, M., Alkaloid profile of leaves and seeds of Lupinus hintonii C.P. Smith, Z. Naturforsch., 2002, 57c, 243-247. [all data]

Woldemichael and Wink, 2002
Woldemichael, G.M.; Wink, M., Concomitant occurrence of pyrrolizidine and quinolizidine alkaloids in hemiparasite Osyris alba L. (Santalaceae), Biochem. Syst. Ecol., 2002, 30, 2, 139-149, https://doi.org/10.1016/S0305-1978(01)00065-5 . [all data]

Martínez-Herrera, Robledo-Quintos, et al., 2001
Martínez-Herrera, J.; Robledo-Quintos, N.; Mora-Escobedo, R.; Dávila-Ortiz, G., Alkaloid composition of Lupinus campestris from Mexico, J. Food Biochem., 2001, 25, 2, 117-125, https://doi.org/10.1111/j.1745-4514.2001.tb00728.x . [all data]

Greinwald, Bachmann, et al., 1995
Greinwald, R.; Bachmann, P.; Lewis, G.; Witte, L.; Czygan, F.-C., Alkaloids of the genus Poecilanthe (Leguminosae: Papilionoideae), Biochem. Syst. Ecol., 1995, 23, 5, 547-553, https://doi.org/10.1016/0305-1978(95)00050-5 . [all data]

Greinwald, Henrichs, et al., 1995
Greinwald, R.; Henrichs, C.; Veen, G.; Ross, J.H.; Witte, L.; Czygan, F.-C., A survey of alkaloids in templetonia biloba (Benth.) Polhill (Fabaceae: Brongniartieae), Biochem. Syst. Ecol., 1995, 23, 6, 649-654, https://doi.org/10.1016/0305-1978(95)00035-6 . [all data]

Kirch, Veit, et al., 1995
Kirch, J.; Veit, M.; Wätzig, Greinwald; Czygan, F.-C., Alkaloidal variation in Genista Iobelii s.l. (Fabaceae), Biochem. Syst. Ecol., 1995, 23, 6, 635-643, https://doi.org/10.1016/0305-1978(95)00037-2 . [all data]

van Wyk, Greinwald, et al., 1995
van Wyk, B.-E.; Greinwald, R.; Witte, L., Alkaloid variation in the Lupinus pusillus group (Fabaceae: tribe Genisteae), Biochem. Syst. Ecol., 1995, 23, 5, 533-537, https://doi.org/10.1016/0305-1978(95)00036-T . [all data]

Planchuelo-Ravelo and Wink, 1993
Planchuelo-Ravelo, A.M.; Wink, M., Alkaloid composition of Lupinus-albescens (Fabaceae) from South America, Z. Naturforsch. C:, 1993, 48, 5-6, 414-416. [all data]

Greinwald, Canto, et al., 1992
Greinwald, R.; Canto, P.; Bachmann, P.; Witte, L.; Czygan, F.-C., Distribution and taxdonomic significance of alkaloids in the Genista cinerea agregat, Biochem. Syst. Ecol., 1992, 20, 1, 75-81, https://doi.org/10.1016/0305-1978(92)90074-N . [all data]

Wink and Witte, 1991
Wink, M.; Witte, L., Storage of quinolizidine alkaloids in Macrosiphum albifrons and Aphis genistae (Homoptera: Aphididae), Entomol. Gener., 1991, 15, 4, 237-254, https://doi.org/10.1127/entom.gen/15/1991/237 . [all data]

Wink, Witte, et al., 1983
Wink, M.; Witte, L.; Hartmann, T.; Theuring, C.; Volz. V., Accumulation of quinolizidine alkaloids in plants and cell suspension cultures: genera lupinus, cytisus, baptisia, genista, laburnum, and sophora, Planta Medica, 1983, 48, 4, 253-257, https://doi.org/10.1055/s-2007-969928 . [all data]

Wink, Witte, et al., 1981
Wink, M.; Witte, L.; Hartmann. T., Quinolizidine Alkaloid Composition of Plants and of Photomixotrophis Cell Suspension Cultures of Sarothamnus scoparius and Orobanche rapum-genistae, Planta Medica, 1981, 43, 12, 342-352, https://doi.org/10.1055/s-2007-971522 . [all data]

Cook, Lee, et al., 2009
Cook, D.; Lee, S.T.; GArdner, D.R.; Pfister, J.A.; Welch, K.D.; Green, B.T.; Davis, T.Z.; Panter, K.E., The alkaloids profiles of lupinus sulphureus, J. Agric. Food Chem., 2009, 57, 4, 1646-1653, https://doi.org/10.1021/jf803468q . [all data]

El-Shazly, Ateya, et al., 2001
El-Shazly, A.; Ateya, A.-M.M.; Wink, M., Quinolizidine alkaloid profiles of lupunus varius orientalis. L. albus albus, L. hartwegii, and L. densiflorus, Z. Naturforsch., 2001, 56c, 21-30. [all data]

Asres, Tei, et al., 1997
Asres, K.; Tei, A.; Wink, M., Quinolizidine alkaloids from the East-African legume Dicraeopetalum stipulare harms, Biochem. Syst. Ecol., 1997, 25, 4, 305-308, https://doi.org/10.1016/S0305-1978(97)00004-5 . [all data]

Greinwald, Ross, et al., 1996
Greinwald, R.; Ross, J.H.; Witte, L.; Czygan, F.-C., Alkaloids of Templetonia incana, Biochem. Syst. Ecol., 1996, 24, 5, 423-426, https://doi.org/10.1016/0305-1978(96)00024-5 . [all data]

Greinwald, van Rensen, et al., 1995
Greinwald, R.; van Rensen, I.; Veit, M.; Canto, P.; Witte, L., A chemical dichotomy in quinolizidine alkaloid accumulation within the section Spartioides of the genus Genista (Fabaceae: Genisteae), Biochem. Syst. Ecol., 1995, 23, 1, 89-97, https://doi.org/10.1016/0305-1978(95)93662-M . [all data]

Greinwald, Ross, et al., 1995
Greinwald, R.; Ross, J.H.; Witte, L.; Czygan, F.-C., The alkaloid pattern of Plagiocarpus axillaris (Fabaceae: Brongniartieae), Biochem. Syst. Ecol., 1995, 23, 6, 645-648, https://doi.org/10.1016/0305-1978(95)00059-3 . [all data]

Wink, Meissner, et al., 1995
Wink, M.; Meissner, C.; Witte, L., Patterns of quinolizidine alkaloids in 56 species of the genus Lupinus, Phytochemistry, 1995, 38, 1, 139-153, https://doi.org/10.1016/0031-9422(95)91890-D . [all data]

Detzel and Wink, 1993
Detzel, A.; Wink, M., Attraction. deterrence or intoxication of bees (Apis mellifera) by plant allelochemicals, Chemoecology, 1993, 4, 1, 8-18, https://doi.org/10.1007/BF01245891 . [all data]

Greinwald, Witte, et al., 1991
Greinwald, R.; Witte, L.; Wray, V.; Czygan, F.-C., The alkaloid pattern of Cytisophyllum sessilitolium (Fabaceae-Genisteae), Biochem. Syst. Ecol., 1991, 19, 3, 253-258, https://doi.org/10.1016/0305-1978(91)90010-W . [all data]