Hexadecane, 2,6,10-trimethyl-

Kovats' RI, non-polar column, isothermal

View large format table.

Column type Active phase Temperature (C) I Reference Comment
CapillarySE-30100.1741.Shlyakhov, Koreshkova, et al., 1975
CapillarySE-30200.1745.Shlyakhov, Koreshkova, et al., 1975
CapillaryApiezon L100.1728.Shlyakhov, Koreshkova, et al., 1975
CapillaryApiezon L200.1729.Shlyakhov, Koreshkova, et al., 1975

Kovats' RI, non-polar column, custom temperature program

View large format table.

Column type Active phase I Reference Comment
CapillaryApiezon L1720.Shlyakhov, 1984Program: not specified
CapillaryApiezon L1727.Shlyakhov, 1984Program: not specified
CapillaryApiezon L1727.Shlyakhov, 1984Program: not specified

Van Den Dool and Kratz RI, non-polar column, temperature ramp

View large format table.

Column type Active phase I Reference Comment
CapillaryCross-Linked Methylsilicone1747.Khorasheh, Gray, et al., 19895. K/min; Tstart: 40. C; Tend: 300. C

Normal alkane RI, non-polar column, custom temperature program

View large format table.

Column type Active phase I Reference Comment
CapillarySqualane1727.Petrov, 1984Program: not specified
CapillaryOV-1, SE-30, Methyl silicone, SP-2100, OV-101, DB-1, etc.1744.Waggott and Davies, 1984Hydrogen; Column length: 50. m; Column diameter: 0.32 mm; Program: not specified

References

Shlyakhov, Koreshkova, et al., 1975
Shlyakhov, A.F.; Koreshkova, R.I.; Telkova, M.S., Gas Chromatography of Isoprenoid Alkanes, J. Chromatogr., 1975, 104, 2, 337-349, https://doi.org/10.1016/S0021-9673(00)91857-0 . [all data]

Shlyakhov, 1984
Shlyakhov, A.F., Gas chromatography in organic geochemistry, Nedra, Moscow, 1984, 221. [all data]

Khorasheh, Gray, et al., 1989
Khorasheh, F.; Gray, M.R.; Selucky, M.L., Correlation for Kováts retention index of C9-C26 monoalkyl and polymethyl alkanes and alkenes, J. Chromatogr., 1989, 481, 1-16, https://doi.org/10.1016/S0021-9673(01)96747-0 . [all data]

Petrov, 1984
Petrov, A.A., Hydrocarbons of petroleum, Nauka (publishing house), Moscow, 1984, 263. [all data]

Waggott and Davies, 1984
Waggott, A.; Davies, I.W., Identification of organic pollutants using linear temperature programmed retention indices (LTPRIs) - Part II, 1984, retrieved from http://dwi.defra.gov.uk/research/completed-research/reports/dwi0383.pdf. [all data]