Phenol, 4-chloro-3-methyl-, acetate

Van Den Dool and Kratz RI, non-polar column, temperature ramp

Data compiled by: NIST Mass Spectrometry Data Center, William E. Wallace, director

Column type CapillaryCapillary
Active phase VF-5MSZB-1
Column length (m) 30.30.
Carrier gas HeHe
Substrate
Column diameter (mm) 0.250.25
Phase thickness (μm) 0.250.50
Tstart (C) 60.50.
Tend (C) 270.280.
Heat rate (K/min)  10.
Initial hold (min)  3.
Final hold (min)  10.
I 1349.1315.
ReferenceTodua, 2011Urbanczyk, Staniewski, et al., 2002
Comment MSDC-RI MSDC-RI

References

Todua, 2011
Todua, N.G., Retention Data. NIST Mass Spectrometry Data Center., NIST Mass Spectrometry Data Center, 2011. [all data]

Urbanczyk, Staniewski, et al., 2002
Urbanczyk, A.; Staniewski, J.; Szymanowski, J., Abraham model in gas chromatography of phenol pollutants, Anal. Chim. Acta., 2002, 466, 1, 151-159, https://doi.org/10.1016/S0003-2670(02)00544-5 . [all data]