2,2-Dicyclohexylbutane

Condensed phase thermochemistry data

Data compiled by: Hussein Y. Afeefy, Joel F. Liebman, and Stephen E. Stein

Quantity Value Units Method Reference Comment
Δcliquid-10240.kJ/molCcbSerijan and Wise, 1952Corresponding Δfliquid = -340. kJ/mol (simple calculation by NIST; no Washburn corrections)

References

Serijan and Wise, 1952
Serijan, K.T.; Wise, P.H., Dicyclic hydrocarbons. V. Synthesis and physical properties of the diphenyl- and dicyclohexylbutanes, J. Am. Chem. Soc., 1952, 74, 365-368. [all data]