1,1'-Bicyclohexyl, 2-butyl-

Phase change data

Data compiled by: Thermodynamics Research Center, NIST Boulder Laboratories, Chris Muzny director

Quantity Value Units Method Reference Comment
Tboil567.30KN/AGoodman and Wise, 1951Uncertainty assigned by TRC = 0.4 K; sample 1 is low boiling isomer
Tboil569.71KN/AGoodman and Wise, 1951Uncertainty assigned by TRC = 0.4 K; sample 2 is high boiling isomer

In addition to the Thermodynamics Research Center (TRC) data available from this site, much more physical and chemical property data is available from the following TRC products:

References

Goodman and Wise, 1951
Goodman, I.A.; Wise, P.H., Dicyclic Hydrocarbons. II. 2-Alkylbicyclohexyls, J. Am. Chem. Soc., 1951, 73, 850-1. [all data]