2(3H)-Furanone, dihydro-4-hydroxy-

Van Den Dool and Kratz RI, non-polar column, custom temperature program

View large format table.

Column type Active phase I Reference Comment
CapillaryHP-5MS1185.1Andriamaharavo, 201430. m/0.25 mm/0.25 μm, He; Program: 60C (1 min) => 5 C/min => 210C => 10 C/min => 280C (15 min)

Normal alkane RI, non-polar column, temperature ramp

View large format table.

Column type Active phase I Reference Comment
CapillaryDB-51153.Cais-Sokolinska, Majcher, et al., 201125. m/0.20 mm/0.33 μm, Helium, 50. C @ 1. min, 20. K/min; Tend: 240. C

Normal alkane RI, polar column, custom temperature program

View large format table.

Column type Active phase I Reference Comment
CapillaryBP-202457.Pontes, Marques, et al., 200730. m/0.25 mm/0.25 μm, He; Program: 50C(1min) => 2.5C/min => 100C => 2C/min => 180C => 15C/min => 220C
CapillaryBP-202457.Pontes, Marques, et al., 200730. m/0.25 mm/0.25 μm, He; Program: 50C(1min) => 2.5C/min => 100C => 2C/min => 180C => 15C/min => 220C

References

Andriamaharavo, 2014
Andriamaharavo, N.R., Retention Data. NIST Mass Spectrometry Data Center., NIST Mass Spectrometry Data Center, 2014. [all data]

Cais-Sokolinska, Majcher, et al., 2011
Cais-Sokolinska, D.; Majcher, M.; Pikul, J.; Bielinska, S.; Czauderma, M.; Wojtowski, J., The effect of Camelia sativa cake diet supplementation on sensory and volatile profiles of ewe's milk, African J. Biotechnol., 2011, 10, 37, 7245-7252. [all data]

Pontes, Marques, et al., 2007
Pontes, M.; Marques, J.C.; Camara, J.S., Screening of volatile composition from Portuguese multifloral honeys using headspace solid-phase microextraction-gas chromatography-quadrupole mass spectrometry, Talanta, 2007, 74, 1, 91-103, https://doi.org/10.1016/j.talanta.2007.05.037 . [all data]